(React Native): Execution failed for task ‘:app:generatePackageList’

  android, execution, gradle, javascript, react-native

I am generating an apk of a project that I developed using React Native. But when I run the command ./gradlew assembleRelease The following error appears:

> Configure project :react-native-audio
WARNING: Configuration 'compile' is obsolete and has been replaced with 'implementation' and 'api'.
It will be removed in version 5.0 of the Android Gradle plugin.
For more information, see http://d.android.com/r/tools/update-dependency-configurations.html.

> Task :app:generatePackageList FAILED

FAILURE: Build failed with an exception.

* Where:
Script 'C:[email protected]act-native-communitycli-platform-androidnative_modules.gradle' line: 131

* What went wrong:
Execution failed for task ':app:generatePackageList'.
> argument type mismatch

* Try:
Run with --stacktrace option to get the stack trace. Run with --info or --debug option to get more log output. Run with --scan to get full insights.

* Get more help at https://help.gradle.org

Deprecated Gradle features were used in this build, making it incompatible with Gradle 8.0.
Use '--warning-mode all' to show the individual deprecation warnings.
See https://docs.gradle.org/7.0/userguide/command_line_interface.html#sec:command_line_warnings

BUILD FAILED in 24s
1 actionable task: 1 executed
PS C:usersromerProjetoAPGravadortesteGravador_de_audioandroid>

How to solve this problem?

Source: Ask Javascript Questions

LEAVE A COMMENT